Pen Settings

HTML

CSS

CSS Base

Vendor Prefixing

Add External Stylesheets/Pens

Any URL's added here will be added as <link>s in order, and before the CSS in the editor. If you link to another Pen, it will include the CSS from that Pen. If the preprocessor matches, it will attempt to combine them before processing.

+ add another resource

JavaScript

Babel is required to process package imports. If you need a different preprocessor remove all packages first.

Add External Scripts/Pens

Any URL's added here will be added as <script>s in order, and run before the JavaScript in the editor. You can use the URL of any other Pen and it will include the JavaScript from that Pen.

+ add another resource

Behavior

Save Automatically?

If active, Pens will autosave every 30 seconds after being saved once.

Auto-Updating Preview

If enabled, the preview panel updates automatically as you code. If disabled, use the "Run" button to update.

Format on Save

If enabled, your code will be formatted when you actively save your Pen. Note: your code becomes un-folded during formatting.

Editor Settings

Code Indentation

Want to change your Syntax Highlighting theme, Fonts and more?

Visit your global Editor Settings.

HTML

              
                serhii@serhii-Aspire-ES1-511 ~/main/rust/app $ cargo build --target wasm32-unknown-unknown --release
   Compiling itoa v0.4.1
   Compiling wasm-bindgen-shared v0.2.5
   Compiling serde v1.0.41
   Compiling dtoa v0.4.2
   Compiling num-traits v0.2.2
   Compiling unicode-xid v0.1.0
   Compiling proc-macro2 v0.3.6
error[E0433]: failed to resolve. Could not find `Group` in `proc_macro`
  --> /home/serhii/.cargo/registry/src/github.com-1ecc6299db9ec823/proc-macro2-0.3.6/src/unstable.rs:63:45
   |
63 |                 let mut group = proc_macro::Group::new(delim, tt.stream.inner.0);
   |                                             ^^^^^ Could not find `Group` in `proc_macro`

error[E0433]: failed to resolve. Could not find `Op` in `proc_macro`
  --> /home/serhii/.cargo/registry/src/github.com-1ecc6299db9ec823/proc-macro2-0.3.6/src/unstable.rs:72:42
   |
72 |                 let mut op = proc_macro::Op::new(tt.op(), spacing);
   |                                          ^^ Could not find `Op` in `proc_macro`

error[E0433]: failed to resolve. Could not find `token_stream` in `proc_macro`
   --> /home/serhii/.cargo/registry/src/github.com-1ecc6299db9ec823/proc-macro2-0.3.6/src/unstable.rs:103:38
    |
103 | pub struct TokenTreeIter(proc_macro::token_stream::IntoIter);
    |                                      ^^^^^^^^^^^^ Could not find `token_stream` in `proc_macro`

error[E0554]: #![feature] may not be used on the stable release channel
  --> /home/serhii/.cargo/registry/src/github.com-1ecc6299db9ec823/proc-macro2-0.3.6/src/lib.rs:28:34
   |
28 | #![cfg_attr(feature = "nightly", feature(proc_macro))]
   |                                  ^^^^^^^^^^^^^^^^^^^^

error: aborting due to 4 previous errors

error: Could not compile `proc-macro2`.
warning: build failed, waiting for other jobs to finish...
error: build failed

              
            
!

CSS

              
                
              
            
!

JS

              
                
              
            
!
999px

Console